Target
Poly [ADP-ribose] polymerase tankyrase-2
Ligand
BDBM26659
Substrate
Meas. Tech.
ChEMBL_948352 (CHEMBL2341186)
IC50
620±n/a nM
Citation
 Narwal, MHaikarainen, TFallarero, AVuorela, PMLehtiö, L Screening and structural analysis of flavones inhibiting tankyrases. J Med Chem 56:3507-17 (2013)  
Target
Name:
Poly [ADP-ribose] polymerase tankyrase-2
Synonyms:
(ARTD6 or PARP5b) Poly [ADP-ribose] polymerase tankyrase-2 TNKL TNKS2_HUMAN Tankyrase 2 Tankyrase-2 Tankyrase-2 (TNKS2)
Type:
Enzyme
Mol. Mass.:
126937.16
Organism:
Homo sapiens (Human)
Description:
Q9H2K2
Residue:
1166
  
Inhibitor
Name:
BDBM26659
Synonyms:
7,3-dihydroxyflavone | 7-hydroxy-2-(3-hydroxyphenyl)-4H-chromen-4-one
Type:
Flavonoid
Emp. Form.:
C15H10O4
Mol. Mass.:
254.2375
SMILES:
Oc1cccc(c1)-c1cc(=O)c2ccc(O)cc2o1
: