Target
Mitogen-activated protein kinase kinase kinase 5
Ligand
BDBM50431302
Substrate
Meas. Tech.
ChEMBL_952963 (CHEMBL2352238)
IC50
1800±n/a nM
Citation
 Volynets, GPBdzhola, VGGolub, AGSynyugin, ARChekanov, MAKukharenko, OPYarmoluk, SM Rational design of apoptosis signal-regulating kinase 1 inhibitors: discovering novel structural scaffold. Eur J Med Chem 61:104-15 (2013)  
Target
Name:
Mitogen-activated protein kinase kinase kinase 5
Synonyms:
ASK1 MAP3K5 MEKK5
Type:
Protein
Mol. Mass.:
154514.93
Organism:
Homo sapiens (Human)
Description:
Q99683
Residue:
1374
  
Inhibitor
Name:
BDBM50431302
Synonyms:
CHEMBL2349218
Type:
Small organic molecule
Emp. Form.:
C19H16N2O6S2
Mol. Mass.:
432.47
SMILES:
CCCC(N1C(=S)S\C(=C/c2ccc(o2)-c2ccc(cc2)[N+]([O-])=O)C1=O)C(O)=O
: