Target
Tyrosine-protein kinase SYK
Ligand
BDBM50431388
Substrate
Meas. Tech.
ChEMBL_949753 (CHEMBL2350851)
IC50
291±n/a nM
Citation
 Padilla, FBhagirath, NChen, SChiao, EGoldstein, DMHermann, JCHsu, JKennedy-Smith, JJKuglstatter, ALiao, CLiu, WLowrie, LELuk, KCLynch, SMMenke, JNiu, LOwens, TDO-Yang, CRailkar, ASchoenfeld, RCSlade, MSteiner, STan, YCVillaseñor, AGWang, CWanner, JXie, WXu, DZhang, XZhou, MLucas, MC Pyrrolopyrazines as selective spleen tyrosine kinase inhibitors. J Med Chem 56:1677-92 (2013)  
Target
Name:
Tyrosine-protein kinase SYK
Synonyms:
KSYK_HUMAN Spleen Tyrosine Kinase Tyrosine-protein kinase SYK (Syk)
Type:
Enzyme
Mol. Mass.:
72079.99
Organism:
Homo sapiens (Human)
Description:
P43405
Residue:
635
  
Inhibitor
Name:
BDBM50431388
Synonyms:
CHEMBL2348855
Type:
Small organic molecule
Emp. Form.:
C18H17ClN6O2
Mol. Mass.:
384.82
SMILES:
C[C@@H](CO)NC(=O)c1c[nH]c2ncc(nc12)-c1nn(C)c2cc(Cl)ccc12
: