Target
Cannabinoid receptor 2
Ligand
BDBM50431426
Substrate
Meas. Tech.
ChEMBL_952418 (CHEMBL2352784)
Ki
19±n/a nM
Citation
 Kusakabe, KTada, YIso, YSakagami, MMorioka, YChomei, NShinonome, SKawamoto, KTakenaka, HYasui, KHamana, HHanasaki, K Design, synthesis, and binding mode prediction of 2-pyridone-based selective CB2 receptor agonists. Bioorg Med Chem 21:2045-55 (2013)  
Target
Name:
Cannabinoid receptor 2
Synonyms:
CANNABINOID CB2 CB2 CB2B CNR2_HUMAN Cannabinoid CB2 receptor Cannabinoid receptor 2 (CB2R) | hCB2
Type:
G Protein-Coupled Receptor (GPCR)
Mol. Mass.:
39690.94
Organism:
Homo sapiens (Human)
Description:
P34972
Residue:
360
  
Inhibitor
Name:
BDBM50431426
Synonyms:
CHEMBL2348280
Type:
Small organic molecule
Emp. Form.:
C22H24N2O2
Mol. Mass.:
348.4382
SMILES:
CCCCn1c(C)c(C)cc(NC(=O)c2cccc3ccccc23)c1=O
: