Target
Proliferating cell nuclear antigen
Ligand
BDBM50431469
Substrate
Meas. Tech.
ChEMBL_952429 (CHEMBL2352795)
IC50
>50000±n/a nM
Citation
 Actis, MInoue, AEvison, BPerry, SPunchihewa, CFujii, N Small molecule inhibitors of PCNA/PIP-box interaction suppress translesion DNA synthesis. Bioorg Med Chem 21:1972-7 (2013)  
Target
Name:
Proliferating cell nuclear antigen
Synonyms:
Cyclin PCNA_HUMAN
Type:
PROTEIN
Mol. Mass.:
28752.86
Organism:
Homo sapiens (Human)
Description:
ChEMBL_952429
Residue:
261
  
Inhibitor
Name:
BDBM50431469
Synonyms:
CHEMBL1236140
Type:
Small organic molecule
Emp. Form.:
C15H13I2NO4
Mol. Mass.:
525.077
SMILES:
N[C@@H](Cc1ccc(Oc2ccc(O)c(I)c2)c(I)c1)C(O)=O
: