Target
Caspase-3
Ligand
BDBM50431517
Substrate
Meas. Tech.
ChEMBL_953009 (CHEMBL2352547)
IC50
47±n/a nM
Citation
 Limpachayaporn, PSchäfers, MSchober, OKopka, KHaufe, G Synthesis of new fluorinated, 2-substituted 5-pyrrolidinylsulfonyl isatin derivatives as caspase-3 and caspase-7 inhibitors: nonradioactive counterparts of putative PET-compatible apoptosis imaging agents. Bioorg Med Chem 21:2025-36 (2013)  
Target
Name:
Caspase-3
Synonyms:
Apopain CASP3 CPP-32 Caspase 3 Caspase-3 subunit p17 SCA-1 Yama protein | caspase-3 preproprotein
Type:
Hydrolase; heterotetramer of two heterodimers
Mol. Mass.:
31607.55
Organism:
Homo sapiens (Human)
Description:
Residue:
277
  
Inhibitor
Name:
BDBM50431517
Synonyms:
CHEMBL2348860
Type:
Small organic molecule
Emp. Form.:
C19H23F3N2O5S
Mol. Mass.:
448.457
SMILES:
CCCCN1C(=O)C(=O)c2cc(ccc12)S(=O)(=O)N1CCC[C@H]1COCC(F)(F)F
: