Target
Caspase-7
Ligand
BDBM50431517
Substrate
Meas. Tech.
ChEMBL_953007 (CHEMBL2352545)
IC50
7.5±n/a nM
Citation
 Limpachayaporn, PSchäfers, MSchober, OKopka, KHaufe, G Synthesis of new fluorinated, 2-substituted 5-pyrrolidinylsulfonyl isatin derivatives as caspase-3 and caspase-7 inhibitors: nonradioactive counterparts of putative PET-compatible apoptosis imaging agents. Bioorg Med Chem 21:2025-36 (2013)  
Target
Name:
Caspase-7
Synonyms:
Apoptotic protease Mch-3 CASP7 CMH-1 MCH3 | caspase 7, apoptosis-related cysteine peptidase
Type:
Enzyme
Mol. Mass.:
34273.91
Organism:
Homo sapiens (Human)
Description:
P55210
Residue:
303
  
Inhibitor
Name:
BDBM50431517
Synonyms:
CHEMBL2348860
Type:
Small organic molecule
Emp. Form.:
C19H23F3N2O5S
Mol. Mass.:
448.457
SMILES:
CCCCN1C(=O)C(=O)c2cc(ccc12)S(=O)(=O)N1CCC[C@H]1COCC(F)(F)F
: