Target
Heparanase
Ligand
BDBM50431643
Substrate
Meas. Tech.
ChEMBL_950896 (CHEMBL2349720)
Kd
639000±n/a nM
Citation
 Gozalbes, RMosulén, SOrtí, LRodríguez-Díaz, JCarbajo, RJMelnyk, PPineda-Lucena, A Hit identification of novel heparanase inhibitors by structure- and ligand-based approaches. Bioorg Med Chem 21:1944-51 (2013)  
Target
Name:
Heparanase
Synonyms:
Endo-glucoronidase HPA HPR1 HPSE1 HSE1 Heparanase 8 kDa subunit | Heparanase-1
Type:
PROTEIN
Mol. Mass.:
61167.67
Organism:
Homo sapiens (Human)
Description:
ChEMBL_327900
Residue:
543
  
Inhibitor
Name:
BDBM50431643
Synonyms:
CHEMBL319756
Type:
Small organic molecule
Emp. Form.:
C27H35ClN6O
Mol. Mass.:
495.059
SMILES:
CN(C)CCNCc1cc(NC(=O)CN2CCCCC2)cc(Nc2ccnc3cc(Cl)ccc23)c1
: