Target
Histone-lysine N-methyltransferase, H3 lysine-79 specific
Ligand
BDBM50396981
Substrate
Meas. Tech.
ChEMBL_951498 (CHEMBL2350651)
Ki
300±n/a nM
Citation
 Yu, WSmil, DLi, FTempel, WFedorov, ONguyen, KTBolshan, YAl-Awar, RKnapp, SArrowsmith, CHVedadi, MBrown, PJSchapira, M Bromo-deaza-SAH: a potent and selective DOT1L inhibitor. Bioorg Med Chem 21:1787-94 (2013)  
Target
Name:
Histone-lysine N-methyltransferase, H3 lysine-79 specific
Synonyms:
2.1.1.43 DOT1-like protein (Dot1L) DOT1L_HUMAN Histone H3-K79 methyltransferase Histone Methyltransferase DOT1L KIAA1814 Lysine N-methyltransferase 4
Type:
Protein
Mol. Mass.:
184911.91
Organism:
Homo sapiens (Human)
Description:
Q8TEK3
Residue:
1537
  
Inhibitor
Name:
BDBM50396981
Synonyms:
CHEMBL2171174
Type:
Small organic molecule
Emp. Form.:
C15H22N6O5S
Mol. Mass.:
398.437
SMILES:
CNc1ncnc2n(cnc12)[C@@H]1O[C@H](CSCC[C@H](N)C(O)=O)[C@@H](O)[C@H]1O
: