Target
Histone-lysine N-methyltransferase, H3 lysine-79 specific
Ligand
BDBM50396023
Substrate
Meas. Tech.
ChEMBL_951499 (CHEMBL2350652)
IC50
0.400000±n/a nM
Citation
 Yu, WSmil, DLi, FTempel, WFedorov, ONguyen, KTBolshan, YAl-Awar, RKnapp, SArrowsmith, CHVedadi, MBrown, PJSchapira, M Bromo-deaza-SAH: a potent and selective DOT1L inhibitor. Bioorg Med Chem 21:1787-94 (2013)  
Target
Name:
Histone-lysine N-methyltransferase, H3 lysine-79 specific
Synonyms:
2.1.1.43 DOT1-like protein (Dot1L) DOT1L_HUMAN Histone H3-K79 methyltransferase Histone Methyltransferase DOT1L KIAA1814 Lysine N-methyltransferase 4
Type:
Protein
Mol. Mass.:
184911.91
Organism:
Homo sapiens (Human)
Description:
Q8TEK3
Residue:
1537
  
Inhibitor
Name:
BDBM50396023
Synonyms:
CHEMBL2169919
Type:
Small organic molecule
Emp. Form.:
C28H41N7O4
Mol. Mass.:
539.6696
SMILES:
CC(C)N(CCCNC(=O)Nc1ccc(cc1)C(C)(C)C)C[C@H]1O[C@H]([C@H](O)[C@@H]1O)n1ccc2c(N)ncnc12
: