Target
Metabotropic glutamate receptor 5
Ligand
BDBM50431702
Substrate
Meas. Tech.
ChEMBL_951534 (CHEMBL2350953)
IC50
63±n/a nM
Citation
 Chae, EShin, YJRyu, EJJi, MKRyune Cho, NLee, KHJeong, HJKim, SJChoi, YSeok Oh, KPark, CESoo Yoon, Y Discovery of biological evaluation of pyrazole/imidazole amides as mGlu5 receptor negative allosteric modulators. Bioorg Med Chem Lett 23:2134-9 (2013)  
Target
Name:
Metabotropic glutamate receptor 5
Synonyms:
GPRC1E GRM5_HUMAN metabotropic glutamate 5 | metabotropic glutamate 5a
Type:
Enzyme
Mol. Mass.:
132484.72
Organism:
Homo sapiens (Human)
Description:
Residue:
1212
  
Inhibitor
Name:
BDBM50431702
Synonyms:
CHEMBL2349528
Type:
Small organic molecule
Emp. Form.:
C13H11ClN2O2
Mol. Mass.:
262.692
SMILES:
Clc1cccc(NC(=O)c2noc3CCCc23)c1
: