Target
Metabotropic glutamate receptor 5
Ligand
BDBM50431724
Substrate
Meas. Tech.
ChEMBL_951534 (CHEMBL2350953)
IC50
56±n/a nM
Citation
 Chae, EShin, YJRyu, EJJi, MKRyune Cho, NLee, KHJeong, HJKim, SJChoi, YSeok Oh, KPark, CESoo Yoon, Y Discovery of biological evaluation of pyrazole/imidazole amides as mGlu5 receptor negative allosteric modulators. Bioorg Med Chem Lett 23:2134-9 (2013)  
Target
Name:
Metabotropic glutamate receptor 5
Synonyms:
GPRC1E GRM5_HUMAN metabotropic glutamate 5 | metabotropic glutamate 5a
Type:
Enzyme
Mol. Mass.:
132484.72
Organism:
Homo sapiens (Human)
Description:
Residue:
1212
  
Inhibitor
Name:
BDBM50431724
Synonyms:
CHEMBL2346719
Type:
Small organic molecule
Emp. Form.:
C17H14ClFN4O
Mol. Mass.:
344.771
SMILES:
Cc1c(nn(C)c1-c1ccc(F)cc1)C(=O)Nc1ccnc(Cl)c1
: