Target
Mu-type opioid receptor
Ligand
BDBM50431840
Substrate
Meas. Tech.
ChEMBL_952444 (CHEMBL2353037)
IC50
120±n/a nM
Citation
 VanAlstine, MAWentland, MPAlvarez, JCao, QCohen, DJKnapp, BIBidlack, JM Redefining the structure-activity relationships of 2,6-methano-3-benzazocines. Part 9: Synthesis, characterization and molecular modeling of pyridinyl isosteres of N-BPE-8-CAC (1), a high affinity ligand for opioid receptors. Bioorg Med Chem Lett 23:2128-33 (2013)  
Target
Name:
Mu-type opioid receptor
Synonyms:
M-OR-1 MOR-1 MUOR1 Mu opiate receptor OPRM1 hMOP | mu-type opioid receptor isoform MOR-1
Type:
G Protein-Coupled Receptor (GPCR)
Mol. Mass.:
44789.51
Organism:
Homo sapiens (Human)
Description:
P35372
Residue:
400
  
Inhibitor
Name:
BDBM50431840
Synonyms:
CHEMBL2347235
Type:
Small organic molecule
Emp. Form.:
C32H37N3O
Mol. Mass.:
479.6557
SMILES:
C[C@H]1C2Cc3ccc(cc3[C@@]1(C)CCN2CC1CC1)C(=O)NCCc1ccc(cc1)-c1ccncc1
: