Target
Kappa-type opioid receptor
Ligand
BDBM50431841
Substrate
Meas. Tech.
ChEMBL_952442 (CHEMBL2353035)
EC50
14±n/a nM
Citation
 VanAlstine, MAWentland, MPAlvarez, JCao, QCohen, DJKnapp, BIBidlack, JM Redefining the structure-activity relationships of 2,6-methano-3-benzazocines. Part 9: Synthesis, characterization and molecular modeling of pyridinyl isosteres of N-BPE-8-CAC (1), a high affinity ligand for opioid receptors. Bioorg Med Chem Lett 23:2128-33 (2013)  
Target
Name:
Kappa-type opioid receptor
Synonyms:
K-OR-1 Kappa-opioid receptor (KOR) Kappa-type opioid receptor (KOR) OPIATE Kappa OPRK1 kappa opioid receptor (KOR)
Type:
G Protein-Coupled Receptor (GPCR)
Mol. Mass.:
42648.76
Organism:
Homo sapiens (Human)
Description:
P41145
Residue:
380
  
Inhibitor
Name:
BDBM50431841
Synonyms:
CHEMBL2347239
Type:
Small organic molecule
Emp. Form.:
C32H37N3O
Mol. Mass.:
479.6557
SMILES:
C[C@H]1C2Cc3ccc(cc3[C@@]1(C)CCN2CC1CC1)C(=O)NCCc1ccc(cn1)-c1ccccc1
: