Target
Kappa-type opioid receptor
Ligand
BDBM50097579
Substrate
Meas. Tech.
ChEMBL_952453 (CHEMBL2353046)
EC50
4.4±n/a nM
Citation
 VanAlstine, MAWentland, MPAlvarez, JCao, QCohen, DJKnapp, BIBidlack, JM Redefining the structure-activity relationships of 2,6-methano-3-benzazocines. Part 9: Synthesis, characterization and molecular modeling of pyridinyl isosteres of N-BPE-8-CAC (1), a high affinity ligand for opioid receptors. Bioorg Med Chem Lett 23:2128-33 (2013)  
Target
Name:
Kappa-type opioid receptor
Synonyms:
K-OR-1 Kappa-opioid receptor (KOR) Kappa-type opioid receptor (KOR) OPIATE Kappa OPRK1 kappa opioid receptor (KOR)
Type:
G Protein-Coupled Receptor (GPCR)
Mol. Mass.:
42648.76
Organism:
Homo sapiens (Human)
Description:
P41145
Residue:
380
  
Inhibitor
Name:
BDBM50097579
Synonyms:
(6S,11R)-3-Cyclopropylmethyl-6,11-dimethyl-1,2,3,4,5,6-hexahydro-2,6-methano-benzo[d]azocine-8-carboxylic acid amide 8-carboxamidocyclazocine US9656961, Example 00157
Type:
Small organic molecule
Emp. Form.:
C19H26N2O
Mol. Mass.:
298.4225
SMILES:
C[C@H]1C2Cc3ccc(cc3[C@@]1(C)CCN2CC1CC1)C(N)=O
: