Target
Matrix metalloproteinase-14
Ligand
BDBM50431942
Substrate
Meas. Tech.
ChEMBL_953676 (CHEMBL2352580)
IC50
>30000±n/a nM
Citation
 Atobe, MMaekawara, NIshiguro, NSogame, SSuenaga, YKawanishi, MSuzuki, HJinno, NTanaka, EMiyoshi, S A series of thiazole derivatives bearing thiazolidin-4-one as non-competitive ADAMTS-5 (aggrecanase-2) inhibitors. Bioorg Med Chem Lett 23:2106-10 (2013)  
Target
Name:
Matrix metalloproteinase-14
Synonyms:
MMP-14 MMP14 MT-MMP 1 MT1MMP Matrix Metalloproteinase-14 (MMP-14) Matrix metalloproteinase-14 Membrane-type matrix metalloproteinase 1 | Membrane-type-1 matrix metalloproteinase
Type:
Protein
Mol. Mass.:
65900.19
Organism:
Homo sapiens (Human)
Description:
P50281
Residue:
582
  
Inhibitor
Name:
BDBM50431942
Synonyms:
CHEMBL2347847
Type:
Small organic molecule
Emp. Form.:
C15H12N2O3S2
Mol. Mass.:
332.397
SMILES:
OC(=O)Cc1sc(\C=C2/NC(=O)CS2)nc1-c1ccccc1
: