Target
Arginase-2, mitochondrial
Ligand
BDBM50431958
Substrate
Meas. Tech.
ChEMBL_954165 (CHEMBL2351680)
IC50
4280±n/a nM
Citation
 Golebiowski, APaul Beckett, RVan Zandt, MJi, MKWhitehouse, DRyder, TRJagdmann, EAndreoli, MMazur, APadmanilayam, MCousido-Siah, AMitschler, ARuiz, FXPodjarny, ASchroeter, H 2-Substituted-2-amino-6-boronohexanoic acids as arginase inhibitors. Bioorg Med Chem Lett 23:2027-30 (2013)  
Target
Name:
Arginase-2, mitochondrial
Synonyms:
ARG2 Arginase II Non-hepatic arginase | Type II arginase
Type:
PROTEIN
Mol. Mass.:
38576.93
Organism:
Homo sapiens (Human)
Description:
ChEMBL_978892
Residue:
354
  
Inhibitor
Name:
BDBM50431958
Synonyms:
CHEMBL2348496
Type:
Small organic molecule
Emp. Form.:
C7H16BNO5
Mol. Mass.:
205.017
SMILES:
NC(CO)(CCCCB(O)O)C(O)=O
: