Target
Extracellular calcium-sensing receptor
Ligand
BDBM50432146
Substrate
Meas. Tech.
ChEMBL_950625 (CHEMBL2352375)
EC50
60±n/a nM
Citation
 Temal, TJary, HAuberval, MLively, SGuédin, DVevert, JPDeprez, P New potent calcimimetics: I. Discovery of a series of novel trisubstituted ureas. Bioorg Med Chem Lett 23:2451-4 (2013)  
Target
Name:
Extracellular calcium-sensing receptor
Synonyms:
CASR CaR Calcium-sensing receptor (CaSR) GPRC2A Parathyroid Cell calcium-sensing receptor Synonyms=GPRC2A | hCasR
Type:
Protein
Mol. Mass.:
120663.13
Organism:
Homo sapiens (Human)
Description:
P41180
Residue:
1078
  
Inhibitor
Name:
BDBM50432146
Synonyms:
CHEMBL2346788
Type:
Small organic molecule
Emp. Form.:
C31H38N4O3
Mol. Mass.:
514.6584
SMILES:
COC(=O)c1cccc(NC(=O)N(CCCN2CCNCC2)CCC(c2ccccc2)c2ccccc2)c1
: