Target
Lactase/phlorizin hydrolase
Ligand
BDBM50432214
Substrate
Meas. Tech.
ChEMBL_950939 (CHEMBL2350012)
IC50
100460±n/a nM
Citation
 Bian, XWang, QKe, CZhao, GLi, Y A new series of N2-substituted-5-(p-toluenesulfonylamino)phthalimide analogues asa-glucosidase inhibitors. Bioorg Med Chem Lett 23:2022-6 (2013)  
Target
Name:
Lactase/phlorizin hydrolase
Synonyms:
LPH_RAT Lct | Lph
Type:
PROTEIN
Mol. Mass.:
217253.31
Organism:
Rattus norvegicus
Description:
ChEMBL_96426
Residue:
1928
  
Inhibitor
Name:
BDBM50432214
Synonyms:
CHEMBL2347151
Type:
Small organic molecule
Emp. Form.:
C23H20N2O6S
Mol. Mass.:
452.48
SMILES:
Cc1ccc(cc1)S(=O)(=O)Nc1ccc2C(=O)N(CCOc3ccc(O)cc3)C(=O)c2c1
: