Target
Plasmepsin II
Ligand
BDBM50432239
Substrate
Meas. Tech.
ChEMBL_950960 (CHEMBL2350286)
IC50
8990±n/a nM
Citation
 Song, YJin, HLiu, XZhu, LHuang, JLi, H Discovery of non-peptide inhibitors of Plasmepsin II by structure-based virtual screening. Bioorg Med Chem Lett 23:2078-82 (2013)  
Target
Name:
Plasmepsin II
Synonyms:
Aspartic hemoglobinase II PLM2_PLAFX Plasmepsin 2 Plasmepsin-II
Type:
Enzyme
Mol. Mass.:
51482.09
Organism:
Plasmodium falciparum
Description:
P46925
Residue:
453
  
Inhibitor
Name:
BDBM50432239
Synonyms:
CHEMBL2347358
Type:
Small organic molecule
Emp. Form.:
C27H23BrN2O3S2
Mol. Mass.:
567.517
SMILES:
Brc1cccc(c1)N(CC(=O)Nc1ccc(CSc2ccccc2)cc1)S(=O)(=O)c1ccccc1
: