Target
Vascular endothelial growth factor receptor 2
Ligand
BDBM50432405
Substrate
Meas. Tech.
ChEMBL_953174 (CHEMBL2353613)
IC50
3.7±n/a nM
Citation
 Miyamoto, NSakai, NHirayama, TMiwa, KOguro, YOki, HOkada, KTakagi, TIwata, HAwazu, YYamasaki, STakeuchi, TMiki, HHori, AImamura, S Discovery of N-[5-({2-[(cyclopropylcarbonyl)amino]imidazo[1,2-b]pyridazin-6-yl}oxy)-2-methylphenyl]-1,3-dimethyl-1H-pyrazole-5-carboxamide (TAK-593), a highly potent VEGFR2 kinase inhibitor. Bioorg Med Chem 21:2333-45 (2013)  
Target
Name:
Vascular endothelial growth factor receptor 2
Synonyms:
CD_antigen=CD309 Fetal liver kinase 1 (FLK-1) KDR Protein-tyrosine kinase receptor Flk-1 VEGFR-2 VEGFR2 Vascular Endothelial Growth Factor Receptor Kinase 2 Vascular endothelial growth factor receptor 2 (KDR) Vascular endothelial growth factor receptor 2 (VEGFR2) Vascular endothelial growth factor receptor-2 (VEGFR-2)
Type:
Receptor Tyrosine Kinase
Mol. Mass.:
151510.97
Organism:
Homo sapiens (Human)
Description:
P35968
Residue:
1356
  
Inhibitor
Name:
BDBM50432405
Synonyms:
CHEMBL2349012
Type:
Small organic molecule
Emp. Form.:
C22H18F3N7O3
Mol. Mass.:
485.4186
SMILES:
Cn1nc(cc1C(=O)Nc1cccc(Oc2ccc3nc(NC(=O)C4CC4)cn3n2)c1)C(F)(F)F
: