Target
Beta-secretase 1
Ligand
BDBM50432511
Substrate
Meas. Tech.
ChEMBL_954240 (CHEMBL2352015)
EC50
8.9±n/a nM
Citation
 Hunt, KWCook, AWWatts, RJClark, CTVigers, GSmith, DMetcalf, ATGunawardana, IWBurkard, MCox, AAGeck Do, MKDutcher, DThomas, AARana, SKallan, NCDeLisle, RKRizzi, JPRegal, KSammond, DGroneberg, RSiu, MPurkey, HLyssikatos, JPMarlow, ALiu, XTang, TP Spirocyclicß-site amyloid precursor protein cleaving enzyme 1 (BACE1) inhibitors: from hit to lowering of cerebrospinal fluid (CSF) amyloidß in a higher species. J Med Chem 56:3379-403 (2013)  
Target
Name:
Beta-secretase 1
Synonyms:
ASP2 Aspartyl protease 2 BACE1 Beta-secretase (BACE) Beta-secretase 1 (BACE 1) Beta-secretase 1 (BACE1) Beta-site amyloid precursor protein cleaving enzyme 1 Memapsin-2 beta-Secretase (BACE-1) | beta-Secretase (BACE1)
Type:
Protein
Mol. Mass.:
55755.10
Organism:
Homo sapiens (Human)
Description:
P56817
Residue:
501
  
Inhibitor
Name:
BDBM50432511
Synonyms:
CHEMBL2349469
Type:
Small organic molecule
Emp. Form.:
C20H21FN4O
Mol. Mass.:
352.4053
SMILES:
CN1C(N)=N[C@@]2(CC(C)(C)Cc3ccc(cc23)-c2cccnc2F)C1=O
: