Target
Histone deacetylase 1
Ligand
BDBM50432559
Substrate
Meas. Tech.
ChEMBL_950485 (CHEMBL2351478)
IC50
123±n/a nM
Citation
 Chen, JBChern, TRWei, TTChen, CCLin, JHFang, JM Design and synthesis of dual-action inhibitors targeting histone deacetylases and 3-hydroxy-3-methylglutaryl coenzyme A reductase for cancer treatment. J Med Chem 56:3645-55 (2013)  
Target
Name:
Histone deacetylase 1
Synonyms:
Cereblon/Histone deacetylase 1 HDAC1 Histone deacetylase 1 (HDAC1) RPD3L1
Type:
Enzyme
Mol. Mass.:
55090.27
Organism:
Homo sapiens (Human)
Description:
Q13547
Residue:
482
  
Inhibitor
Name:
BDBM50432559
Synonyms:
CHEMBL2347008 | US9353061, Atorva-HA (5)
Type:
Small organic molecule
Emp. Form.:
C33H36FN3O5
Mol. Mass.:
573.6544
SMILES:
CC(C)c1c(C(=O)Nc2ccccc2)c(c(-c2ccc(F)cc2)n1CC[C@@H](O)C[C@@H](O)CC(=O)NO)-c1ccccc1
: