Target
Beta-secretase 1
Ligand
BDBM50432596
Substrate
Meas. Tech.
ChEMBL_951004 (CHEMBL2350618)
IC50
400±n/a nM
Citation
 Hilpert, HGuba, WWoltering, TJWostl, WPinard, EMauser, HMayweg, AVRogers-Evans, MHumm, RKrummenacher, DMuser, TSchnider, CJacobsen, HOzmen, LBergadano, ABanner, DWHochstrasser, RKuglstatter, ADavid-Pierson, PFischer, HPolara, ANarquizian, R ß-Secretase (BACE1) inhibitors with high in vivo efficacy suitable for clinical evaluation in Alzheimer's disease. J Med Chem 56:3980-95 (2013)  
Target
Name:
Beta-secretase 1
Synonyms:
ASP2 Aspartyl protease 2 BACE1 Beta-secretase (BACE) Beta-secretase 1 (BACE 1) Beta-secretase 1 (BACE1) Beta-site amyloid precursor protein cleaving enzyme 1 Memapsin-2 beta-Secretase (BACE-1) | beta-Secretase (BACE1)
Type:
Protein
Mol. Mass.:
55755.10
Organism:
Homo sapiens (Human)
Description:
P56817
Residue:
501
  
Inhibitor
Name:
BDBM50432596
Synonyms:
CHEMBL2347190
Type:
Small organic molecule
Emp. Form.:
C18H13F4N5O2
Mol. Mass.:
407.3217
SMILES:
NC1=N[C@](CF)(c2cc(NC(=O)c3ccc(cn3)C#N)ccc2F)C(F)(F)CO1
: