Target
Beta-secretase 1
Ligand
BDBM50432612
Substrate
Meas. Tech.
ChEMBL_951004 (CHEMBL2350618)
IC50
131±n/a nM
Citation
 Hilpert, HGuba, WWoltering, TJWostl, WPinard, EMauser, HMayweg, AVRogers-Evans, MHumm, RKrummenacher, DMuser, TSchnider, CJacobsen, HOzmen, LBergadano, ABanner, DWHochstrasser, RKuglstatter, ADavid-Pierson, PFischer, HPolara, ANarquizian, R ß-Secretase (BACE1) inhibitors with high in vivo efficacy suitable for clinical evaluation in Alzheimer's disease. J Med Chem 56:3980-95 (2013)  
Target
Name:
Beta-secretase 1
Synonyms:
ASP2 Aspartyl protease 2 BACE1 Beta-secretase (BACE) Beta-secretase 1 (BACE 1) Beta-secretase 1 (BACE1) Beta-site amyloid precursor protein cleaving enzyme 1 Memapsin-2 beta-Secretase (BACE-1) | beta-Secretase (BACE1)
Type:
Protein
Mol. Mass.:
55755.10
Organism:
Homo sapiens (Human)
Description:
P56817
Residue:
501
  
Inhibitor
Name:
BDBM50432612
Synonyms:
CHEMBL2347200
Type:
Small organic molecule
Emp. Form.:
C16H15ClF3N5O2
Mol. Mass.:
401.771
SMILES:
Cn1cc(Cl)c(n1)C(=O)Nc1ccc(F)c(c1)[C@@]1(C)N=C(N)OCC1(F)F
: