Target
Beta-3 adrenergic receptor
Ligand
BDBM50432704
Substrate
Meas. Tech.
ChEMBL_952277 (CHEMBL2351583)
Kd
2630±n/a nM
Citation
 Mistry, SNBaker, JGFischer, PMHill, SJGardiner, SMKellam, B Synthesis and in vitro and in vivo characterization of highlyß1-selectiveß-adrenoceptor partial agonists. J Med Chem 56:3852-65 (2013)  
Target
Name:
Beta-3 adrenergic receptor
Synonyms:
ADRB3 ADRB3_HUMAN Beta-2 adrenergic receptor and beta-3 adrenergic receptor Beta-3 adrenoreceptor | adrenergic Beta3
Type:
G Protein-Coupled Receptor (GPCR)
Mol. Mass.:
43534.88
Organism:
Homo sapiens (Human)
Description:
Residue:
408
  
Inhibitor
Name:
BDBM50432704
Synonyms:
CHEMBL2348218
Type:
Small organic molecule
Emp. Form.:
C28H34FN3O6
Mol. Mass.:
527.5845
SMILES:
OC(CNCCNC(=O)Nc1ccc(O)cc1)COc1ccc(OCCOCCc2ccc(F)cc2)cc1
: