Target
Beta-2 adrenergic receptor
Ligand
BDBM50027885
Substrate
Meas. Tech.
ChEMBL_952281 (CHEMBL2351860)
Kd
871±n/a nM
Citation
 Mistry, SNBaker, JGFischer, PMHill, SJGardiner, SMKellam, B Synthesis and in vitro and in vivo characterization of highlyß1-selectiveß-adrenoceptor partial agonists. J Med Chem 56:3852-65 (2013)  
Target
Name:
Beta-2 adrenergic receptor
Synonyms:
ADRB2 ADRB2_HUMAN Beta-2 adrenoceptor | Beta-2 adrenoreceptor
Type:
Mol. Mass.:
46461.69
Organism:
Homo sapiens (Human)
Description:
P07550
Residue:
413
  
Inhibitor
Name:
BDBM50027885
Synonyms:
CHEMBL2348213
Type:
Small organic molecule
Emp. Form.:
C26H37N3O5
Mol. Mass.:
471.5891
SMILES:
Cc1cccc(NC(=O)NCCNCC(O)COc2ccc(OCCOC3CCCC3)cc2)c1
: