Target
Beta-2 adrenergic receptor
Ligand
BDBM50027888
Substrate
Meas. Tech.
ChEMBL_952281 (CHEMBL2351860)
Kd
1413±n/a nM
Citation
 Mistry, SNBaker, JGFischer, PMHill, SJGardiner, SMKellam, B Synthesis and in vitro and in vivo characterization of highlyß1-selectiveß-adrenoceptor partial agonists. J Med Chem 56:3852-65 (2013)  
Target
Name:
Beta-2 adrenergic receptor
Synonyms:
ADRB2 ADRB2_HUMAN Beta-2 adrenoceptor | Beta-2 adrenoreceptor
Type:
Mol. Mass.:
46461.69
Organism:
Homo sapiens (Human)
Description:
P07550
Residue:
413
  
Inhibitor
Name:
BDBM50027888
Synonyms:
CHEMBL2348210
Type:
Small organic molecule
Emp. Form.:
C25H35N3O6
Mol. Mass.:
473.5619
SMILES:
OC(CNCCNC(=O)Nc1cccc(O)c1)COc1ccc(OCCOC2CCCC2)cc1
: