Target
Peptidyl-prolyl cis-trans isomerase FKBP5
Ligand
BDBM50388298
Substrate
Meas. Tech.
ChEMBL_952910 (CHEMBL2351899)
Ki
200±n/a nM
Citation
 Wang, YKirschner, AFabian, AKGopalakrishnan, RKress, CHoogeland, BKoch, UKozany, CBracher, AHausch, F Increasing the efficiency of ligands for FK506-binding protein 51 by conformational control. J Med Chem 56:3922-35 (2013)  
Target
Name:
Peptidyl-prolyl cis-trans isomerase FKBP5
Synonyms:
51 kDa FK506-binding protein 54 kDa progesterone receptor-associated immunophilin Androgen-regulated protein 6 FK506-binding protein 5 FKBP-51 FKBP51 FKBP5_HUMAN PPIase FKBP5 p54
Type:
PROTEIN
Mol. Mass.:
51207.06
Organism:
Homo sapiens (Human)
Description:
ChEMBL_952910
Residue:
457
  
Inhibitor
Name:
BDBM50388298
Synonyms:
CHEMBL2058794
Type:
Small organic molecule
Emp. Form.:
C35H42Cl2N2O9S
Mol. Mass.:
737.687
SMILES:
COc1ccc(CC[C@@H](OC(=O)[C@@H]2CCCCN2S(=O)(=O)c2cc(Cl)c(O)c(Cl)c2)c2cccc(OCCN3CCOCC3)c2)cc1OC
: