Target
E3 ubiquitin-protein ligase XIAP
Ligand
BDBM50432757
Substrate
Meas. Tech.
ChEMBL_952938 (CHEMBL2351927)
Ki
4.5±n/a nM
Citation
 Sheng, RSun, HLiu, LLu, JMcEachern, DWang, GWen, JMin, PDu, ZLu, HKang, SGuo, MYang, DWang, S A potent bivalent Smac mimetic (SM-1200) achieving rapid, complete, and durable tumor regression in mice. J Med Chem 56:3969-79 (2013)  
Target
Name:
E3 ubiquitin-protein ligase XIAP
Synonyms:
API3 E3 ubiquitin-protein ligase XIAP Inhibitor of apoptosis protein 3 X-linked inhibitor of apoptosis XIAP | XIAP_HUMAN
Type:
Protein
Mol. Mass.:
56685.27
Organism:
Homo sapiens (Human)
Description:
P98170
Residue:
497
  
Inhibitor
Name:
BDBM50432757
Synonyms:
CHEMBL2348617
Type:
Small organic molecule
Emp. Form.:
C60H76N12O8
Mol. Mass.:
1093.321
SMILES:
CN[C@@H](C)C(=O)N[C@H]1CN(CC[C@H]2CC[C@H](N2C1=O)C(=O)NC(c1ccccc1)c1ccccc1)C(=O)N1CCN(CC1)C(=O)N1CC[C@H]2CC[C@H](N2C(=O)[C@H](C1)NC(=O)[C@H](C)NC)C(=O)NC(c1ccccc1)c1ccccc1
: