Target
Inosine-5'-monophosphate dehydrogenase
Ligand
BDBM50432766
Substrate
Meas. Tech.
ChEMBL_953211 (CHEMBL2353886)
IC50
50±n/a nM
Citation
 Gorla, SKKavitha, MZhang, MChin, JELiu, XStriepen, BMakowska-Grzyska, MKim, YJoachimiak, AHedstrom, LCuny, GD Optimization of benzoxazole-based inhibitors of Cryptosporidium parvum inosine 5'-monophosphate dehydrogenase. J Med Chem 56:4028-43 (2013)  
Target
Name:
Inosine-5'-monophosphate dehydrogenase
Synonyms:
Cgd6_20 protein Inosine-5'-monophosphate dehydrogenase, probable | Inosine-5-monophosphate dehydrogenase (IMPDH)
Type:
Protein
Mol. Mass.:
43076.80
Organism:
Cryptosporidium parvum
Description:
Q8T6T2
Residue:
400
  
Inhibitor
Name:
BDBM50432766
Synonyms:
CHEMBL2348636
Type:
Small organic molecule
Emp. Form.:
C21H15Cl2N3O2
Mol. Mass.:
412.269
SMILES:
C[C@@H](C(=O)Nc1ccc2oc(nc2c1)-c1ccncc1)c1cccc(Cl)c1Cl
: