Target
Transient receptor potential cation channel subfamily A member 1
Ligand
BDBM50432907
Substrate
Meas. Tech.
ChEMBL_956684 (CHEMBL2379081)
IC50
97200±n/a nM
Citation
 Ortar, GMorera, EDe Petrocellis, LLigresti, ASchiano Moriello, AMorera, LNalli, MRagno, RPirolli, ADi Marzo, V Biaryl tetrazolyl ureas as inhibitors of endocannabinoid metabolism: modulation at the N-portion and distal phenyl ring. Eur J Med Chem 63:118-32 (2013)  
Target
Name:
Transient receptor potential cation channel subfamily A member 1
Synonyms:
Anktm1 Trpa1
Type:
PROTEIN
Mol. Mass.:
128622.74
Organism:
Rattus norvegicus
Description:
ChEMBL_1450487
Residue:
1125
  
Inhibitor
Name:
BDBM50432907
Synonyms:
CHEMBL2376845
Type:
Small organic molecule
Emp. Form.:
C19H19N5O2
Mol. Mass.:
349.3865
SMILES:
CN(C)C(=O)n1nnc(Cc2ccc(cc2)-c2cccc(c2)C(C)=O)n1
: