Target
Aminopeptidase N
Ligand
BDBM50433059
Substrate
Meas. Tech.
ChEMBL_955827 (CHEMBL2379684)
IC50
5300±n/a nM
Citation
 Jin, KZhang, XMa, CXu, YYuan, YXu, W Novel indoline-2,3-dione derivatives as inhibitors of aminopeptidase N (APN). Bioorg Med Chem 21:2663-70 (2013)  
Target
Name:
Aminopeptidase N
Synonyms:
AMPN_PIG AP-M Alanyl aminopeptidase Aminopeptidase N (APN) Microsomal aminopeptidase pAPN
Type:
Protein
Mol. Mass.:
108810.25
Organism:
Sus scrofa (Pig)
Description:
P15145
Residue:
963
  
Inhibitor
Name:
BDBM50433059
Synonyms:
CHEMBL2376105
Type:
Small organic molecule
Emp. Form.:
C12H11FN2O5
Mol. Mass.:
282.2245
SMILES:
ONC(=O)CN1C(=O)C2(OCCO2)c2cc(F)ccc12
: