Target
Carbonic anhydrase
Ligand
BDBM50387133
Substrate
Meas. Tech.
ChEMBL_955915 (CHEMBL2379884)
Ki
1431±n/a nM
Citation
 Vullo, DLeewattanapasuk, WMühlschlegel, FAMastrolorenzo, ACapasso, CSupuran, CT Carbonic anhydrase inhibitors: inhibition of the฿-class enzyme from the pathogenic yeast Candida glabrata with sulfonamides, sulfamates and sulfamides. Bioorg Med Chem Lett 23:2647-52 (2013)  
Target
Name:
Carbonic anhydrase
Synonyms:
CAN_CANAL beta-Carbonic Anhydrase
Type:
Enzyme
Mol. Mass.:
31587.59
Organism:
Candida albicans (Yeast)
Description:
Residue:
281
  
Inhibitor
Name:
BDBM50387133
Synonyms:
CHEMBL2047813
Type:
Small organic molecule
Emp. Form.:
C17H15N3O4S
Mol. Mass.:
357.384
SMILES:
NS(=O)(=O)Oc1ccc(NC(=O)Nc2cccc3ccccc23)cc1
: