Target
Long-chain fatty acid transport protein 1
Ligand
BDBM50433129
Substrate
Meas. Tech.
ChEMBL_956920 (CHEMBL2378196)
IC50
190±n/a nM
Citation
 Matsufuji, TIkeda, MNaito, AHirouchi, MKanda, SIzumi, MHarada, JShinozuka, T Arylpiperazines as fatty acid transport protein 1 (FATP1) inhibitors with improved potency and pharmacokinetic properties. Bioorg Med Chem Lett 23:2560-5 (2013)  
Target
Name:
Long-chain fatty acid transport protein 1
Synonyms:
6.2.1.- FATP-1 Fatty acid transport protein 1 SLC27A1 | Solute carrier family 27 member 1
Type:
PROTEIN
Mol. Mass.:
71123.97
Organism:
Homo sapiens (Human)
Description:
ChEMBL_956920
Residue:
646
  
Inhibitor
Name:
BDBM50433129
Synonyms:
CHEMBL2377610
Type:
Small organic molecule
Emp. Form.:
C19H24FN5O
Mol. Mass.:
357.4252
SMILES:
Cc1nc2CCCCn2c1C(=O)CN1CCN(CC1)c1ccc(F)cn1
: