Target
Long-chain fatty acid transport protein 1
Ligand
BDBM50433148
Substrate
Meas. Tech.
ChEMBL_956920 (CHEMBL2378196)
IC50
>1000±n/a nM
Citation
 Matsufuji, TIkeda, MNaito, AHirouchi, MKanda, SIzumi, MHarada, JShinozuka, T Arylpiperazines as fatty acid transport protein 1 (FATP1) inhibitors with improved potency and pharmacokinetic properties. Bioorg Med Chem Lett 23:2560-5 (2013)  
Target
Name:
Long-chain fatty acid transport protein 1
Synonyms:
6.2.1.- FATP-1 Fatty acid transport protein 1 SLC27A1 | Solute carrier family 27 member 1
Type:
PROTEIN
Mol. Mass.:
71123.97
Organism:
Homo sapiens (Human)
Description:
ChEMBL_956920
Residue:
646
  
Inhibitor
Name:
BDBM50433148
Synonyms:
CHEMBL2377759
Type:
Small organic molecule
Emp. Form.:
C19H23FN4OS
Mol. Mass.:
374.476
SMILES:
Fc1cccc(c1)N1CCN(CC(=O)Nc2nc3CCCCc3s2)CC1
: