Target
Sterol O-acyltransferase 2
Ligand
BDBM50433205
Substrate
Meas. Tech.
ChEMBL_957099 (CHEMBL2378564)
IC50
500±n/a nM
Citation
 Ohtawa, MYamazaki, HMatsuda, DOhshiro, TRudel, LLOmura, STomoda, HNagamitsu, T Synthesis and structure-activity relationship of pyripyropene A derivatives as potent and selective acyl-CoA:cholesterol acyltransferase 2 (ACAT2) inhibitors: part 2. Bioorg Med Chem Lett 23:2659-62 (2013)  
Target
Name:
Sterol O-acyltransferase 2
Synonyms:
ACACT2 ACAT2 Acetyl-CoA transferase-like protein Cholesterol acyltransferase 2 SOAT2 | SOAT2_HUMAN
Type:
Enzyme
Mol. Mass.:
59912.75
Organism:
Homo sapiens (Human)
Description:
O75908
Residue:
522
  
Inhibitor
Name:
BDBM50433205
Synonyms:
CHEMBL2375695
Type:
Small organic molecule
Emp. Form.:
C36H39NO10
Mol. Mass.:
645.6956
SMILES:
CC(=O)OC[C@]1(C)[C@H](CC[C@@]2(C)[C@H]1C[C@H](OC(C)=O)[C@@]1(C)Oc3cc(oc(=O)c3[C@H](O)[C@H]21)-c1cccnc1)OC(=O)c1ccccc1
: