Target
Acetylcholinesterase
Ligand
BDBM50433313
Substrate
Meas. Tech.
ChEMBL_957892 (CHEMBL2377917)
Ki
16±n/a nM
Citation
 Chen, YSun, JHuang, ZLiao, HPeng, SLehmann, JZhang, Y Design, synthesis and evaluation of tacrine-flurbiprofen-nitrate trihybrids as novel anti-Alzheimer's disease agents. Bioorg Med Chem 21:2462-70 (2013)  
Target
Name:
Acetylcholinesterase
Synonyms:
ACES_ELEEL Acetylcholinesterase (EeAChE) | ache
Type:
Enzyme
Mol. Mass.:
71812.79
Organism:
Electrophorus electricus (Electric eel)
Description:
Residue:
633
  
Inhibitor
Name:
BDBM50433313
Synonyms:
CHEMBL2376474
Type:
Small organic molecule
Emp. Form.:
C36H41FN4O5
Mol. Mass.:
628.7329
SMILES:
CC(C(=O)NCCCCCCNc1c2CCCCc2nc2ccccc12)c1ccc(c(F)c1)-c1ccc(OCCO[N+]([O-])=O)cc1
: