Target
Methionine aminopeptidase 1
Ligand
BDBM50433376
Substrate
Meas. Tech.
ChEMBL_957175 (CHEMBL2378713)
EC50
430±n/a nM
Citation
 Zhang, FBhat, SGabelli, SBChen, XMiller, MSNacev, BACheng, YLMeyers, DJTenney, KShim, JSCrews, PAmzel, LMMa, DLiu, JO Pyridinylquinazolines selectively inhibit human methionine aminopeptidase-1 in cells. J Med Chem 56:3996-4016 (2013)  
Target
Name:
Methionine aminopeptidase 1
Synonyms:
Aminopeptidase MAP 1 METAP1 Methionine Aminopeptidase Type 1 (MetAP1) | Peptidase M 1
Type:
Enzyme
Mol. Mass.:
43220.79
Organism:
Homo sapiens (Human)
Description:
MetAP1 with an N-terminal six histidine tag was expressed in baculovirus infected sf9 cells.
Residue:
386
  
Inhibitor
Name:
BDBM50433376
Synonyms:
CHEMBL2375627
Type:
Small organic molecule
Emp. Form.:
C28H29Cl2N5
Mol. Mass.:
506.469
SMILES:
Cc1nc(nc(NC[C@@H](NCCCCc2ccccc2)c2ccccc2)c1Cl)-c1ccc(Cl)cn1
: