Target
Methionine aminopeptidase 2
Ligand
BDBM50433397
Substrate
Meas. Tech.
ChEMBL_957169 (CHEMBL2378707)
EC50
>200000±n/a nM
Citation
 Zhang, FBhat, SGabelli, SBChen, XMiller, MSNacev, BACheng, YLMeyers, DJTenney, KShim, JSCrews, PAmzel, LMMa, DLiu, JO Pyridinylquinazolines selectively inhibit human methionine aminopeptidase-1 in cells. J Med Chem 56:3996-4016 (2013)  
Target
Name:
Methionine aminopeptidase 2
Synonyms:
Initiation factor 2-associated 67 kDa glycoprotein MAP2_HUMAN MNPEP Methionine aminopeptidase 2 (MetAP2) P67EIF2 p67
Type:
Enzyme
Mol. Mass.:
52884.45
Organism:
Homo sapiens (Human)
Description:
P50579
Residue:
478
  
Inhibitor
Name:
BDBM50433397
Synonyms:
CHEMBL2375626
Type:
Small organic molecule
Emp. Form.:
C25H23BrN4O
Mol. Mass.:
475.38
SMILES:
COc1ccc(cc1)N1CCN(CC1)c1cc(nc2ccccc12)-c1ccc(Br)cn1
: