Target
Glycogen [starch] synthase, muscle
Ligand
BDBM50433689
Substrate
Meas. Tech.
ChEMBL_959319 (CHEMBL2384006)
EC50
770±n/a nM
Citation
 Qian, YBolin, DConde-Knape, KGillespie, PHayden, SHuang, KSOlivier, ARSato, TXiang, QYun, WZhang, X Design and synthesis of 2-N-substituted indazolone derivatives as non-carboxylic acid glycogen synthase activators. Bioorg Med Chem Lett 23:2936-40 (2013)  
Target
Name:
Glycogen [starch] synthase, muscle
Synonyms:
GYS GYS1_HUMAN Glycogen synthase (GYS1) | Muscle glycogen synthase
Type:
Enzyme
Mol. Mass.:
83779.52
Organism:
Homo sapiens (Human)
Description:
P13807
Residue:
737
  
Inhibitor
Name:
BDBM50433689
Synonyms:
CHEMBL2381151
Type:
Small organic molecule
Emp. Form.:
C22H17F3N2O3
Mol. Mass.:
414.3772
SMILES:
OCCn1[nH]c2c(COc3ccc(cc3)-c3cc(F)c(F)cc3F)cccc2c1=O
: