Target
Glycogen [starch] synthase, muscle
Ligand
BDBM50433690
Substrate
Meas. Tech.
ChEMBL_959319 (CHEMBL2384006)
EC50
200±n/a nM
Citation
 Qian, YBolin, DConde-Knape, KGillespie, PHayden, SHuang, KSOlivier, ARSato, TXiang, QYun, WZhang, X Design and synthesis of 2-N-substituted indazolone derivatives as non-carboxylic acid glycogen synthase activators. Bioorg Med Chem Lett 23:2936-40 (2013)  
Target
Name:
Glycogen [starch] synthase, muscle
Synonyms:
GYS GYS1_HUMAN Glycogen synthase (GYS1) | Muscle glycogen synthase
Type:
Enzyme
Mol. Mass.:
83779.52
Organism:
Homo sapiens (Human)
Description:
P13807
Residue:
737
  
Inhibitor
Name:
BDBM50433690
Synonyms:
CHEMBL2381150
Type:
Small organic molecule
Emp. Form.:
C23H18F2N2O5
Mol. Mass.:
440.3962
SMILES:
COc1cc(F)c(F)cc1-c1ccc(OCc2cccc3c2[nH]n(CC(O)=O)c3=O)cc1
: