Target
Matrix metalloproteinase-14
Ligand
BDBM50433870
Substrate
Meas. Tech.
ChEMBL_959632 (CHEMBL2382702)
Ki
>200000±n/a nM
Citation
 Jin, YRoycik, MDBosco, DBCao, QConstantino, MHSchwartz, MASang, QX Matrix metalloproteinase inhibitors based on the 3-mercaptopyrrolidine core. J Med Chem 56:4357-73 (2013)  
Target
Name:
Matrix metalloproteinase-14
Synonyms:
MMP-14 MMP14 MT-MMP 1 MT1MMP Matrix Metalloproteinase-14 (MMP-14) Matrix metalloproteinase-14 Membrane-type matrix metalloproteinase 1 | Membrane-type-1 matrix metalloproteinase
Type:
Protein
Mol. Mass.:
65900.19
Organism:
Homo sapiens (Human)
Description:
P50281
Residue:
582
  
Inhibitor
Name:
BDBM50433870
Synonyms:
CHEMBL2380397
Type:
Small organic molecule
Emp. Form.:
C17H19NO4S
Mol. Mass.:
333.402
SMILES:
O[C@H]1CCC[C@@H]1NS(=O)(=O)c1ccc(Oc2ccccc2)cc1
: