Target
Matrix metalloproteinase-14
Ligand
BDBM50433880
Substrate
Meas. Tech.
ChEMBL_959632 (CHEMBL2382702)
Ki
6.2±n/a nM
Citation
 Jin, YRoycik, MDBosco, DBCao, QConstantino, MHSchwartz, MASang, QX Matrix metalloproteinase inhibitors based on the 3-mercaptopyrrolidine core. J Med Chem 56:4357-73 (2013)  
Target
Name:
Matrix metalloproteinase-14
Synonyms:
MMP-14 MMP14 MT-MMP 1 MT1MMP Matrix Metalloproteinase-14 (MMP-14) Matrix metalloproteinase-14 Membrane-type matrix metalloproteinase 1 | Membrane-type-1 matrix metalloproteinase
Type:
Protein
Mol. Mass.:
65900.19
Organism:
Homo sapiens (Human)
Description:
P50281
Residue:
582
  
Inhibitor
Name:
BDBM50433880
Synonyms:
CHEMBL2380387
Type:
Small organic molecule
Emp. Form.:
C22H33N3O3S2
Mol. Mass.:
451.646
SMILES:
CNC(=O)[C@H](Cc1ccccc1)NC(=O)[C@@H](CC(C)C)S[C@H]1CN(C[C@H]1S)C(C)=O
: