Target
Matrilysin
Ligand
BDBM50433863
Substrate
Meas. Tech.
ChEMBL_959635 (CHEMBL2382705)
Ki
>100000±n/a nM
Citation
 Jin, YRoycik, MDBosco, DBCao, QConstantino, MHSchwartz, MASang, QX Matrix metalloproteinase inhibitors based on the 3-mercaptopyrrolidine core. J Med Chem 56:4357-73 (2013)  
Target
Name:
Matrilysin
Synonyms:
MMP7 MPSL1 Matrix metalloproteinase-7 (MMP-7) PUMP1
Type:
Enzyme
Mol. Mass.:
29681.54
Organism:
Homo sapiens (Human)
Description:
P09237
Residue:
267
  
Inhibitor
Name:
BDBM50433863
Synonyms:
CHEMBL2380404
Type:
Small organic molecule
Emp. Form.:
C22H29N3O5S
Mol. Mass.:
447.548
SMILES:
NCCCCCC(=O)N1C[C@H](O)[C@H](C1)NS(=O)(=O)c1ccc(Oc2ccccc2)cc1
: