Target
Matrilysin
Ligand
BDBM50433866
Substrate
Meas. Tech.
ChEMBL_959635 (CHEMBL2382705)
Ki
>12000±n/a nM
Citation
 Jin, YRoycik, MDBosco, DBCao, QConstantino, MHSchwartz, MASang, QX Matrix metalloproteinase inhibitors based on the 3-mercaptopyrrolidine core. J Med Chem 56:4357-73 (2013)  
Target
Name:
Matrilysin
Synonyms:
MMP7 MPSL1 Matrix metalloproteinase-7 (MMP-7) PUMP1
Type:
Enzyme
Mol. Mass.:
29681.54
Organism:
Homo sapiens (Human)
Description:
P09237
Residue:
267
  
Inhibitor
Name:
BDBM50433866
Synonyms:
CHEMBL2380314
Type:
Small organic molecule
Emp. Form.:
C27H26N4O6S2
Mol. Mass.:
566.649
SMILES:
S[C@H]1CN(C[C@@H]1NS(=O)(=O)c1ccc(Oc2ccccc2)cc1)C(=O)NCCN1C(=O)c2ccccc2C1=O
: