Target
Matrilysin
Ligand
BDBM50433874
Substrate
Meas. Tech.
ChEMBL_959635 (CHEMBL2382705)
Ki
>50000±n/a nM
Citation
 Jin, YRoycik, MDBosco, DBCao, QConstantino, MHSchwartz, MASang, QX Matrix metalloproteinase inhibitors based on the 3-mercaptopyrrolidine core. J Med Chem 56:4357-73 (2013)  
Target
Name:
Matrilysin
Synonyms:
MMP7 MPSL1 Matrix metalloproteinase-7 (MMP-7) PUMP1
Type:
Enzyme
Mol. Mass.:
29681.54
Organism:
Homo sapiens (Human)
Description:
P09237
Residue:
267
  
Inhibitor
Name:
BDBM50433874
Synonyms:
CHEMBL2380393
Type:
Small organic molecule
Emp. Form.:
C11H15NO2S2
Mol. Mass.:
257.372
SMILES:
S[C@H]1CCC[C@@H]1NS(=O)(=O)c1ccccc1
: