Target
Prostate-specific antigen
Ligand
BDBM50099216
Substrate
Meas. Tech.
ChEMBL_959179 (CHEMBL2383462)
IC50
226±n/a nM
Citation
 Kostova, MBRosen, DMChen, YMease, RCDenmeade, SR Structural optimization, biological evaluation, and application of peptidomimetic prostate specific antigen inhibitors. J Med Chem 56:4224-35 (2013)  
Target
Name:
Prostate-specific antigen
Synonyms:
APS KLK3 Kallikrein-3 PSA Prostate-specific antigen Seminin
Type:
PROTEIN
Mol. Mass.:
28747.53
Organism:
Homo sapiens (Human)
Description:
ChEMBL_959198
Residue:
261
  
Inhibitor
Name:
BDBM50099216
Synonyms:
(2S,3S)-1-[2-(3-Benzyloxycarbonyl-phenyl)-acetyl]-3-(4-hydroxy-benzyl)-4-oxo-azetidine-2-carboxylic acid benzyl ester CHEMBL286934
Type:
Small organic molecule
Emp. Form.:
C34H29NO7
Mol. Mass.:
563.5966
SMILES:
Oc1ccc(C[C@H]2[C@H](N(C(=O)Cc3cccc(c3)C(=O)OCc3ccccc3)C2=O)C(=O)OCc2ccccc2)cc1
: