Target
Poly [ADP-ribose] polymerase 1
Ligand
BDBM50294835
Substrate
Meas. Tech.
ChEMBL_959447 (CHEMBL2384485)
IC50
>85000±n/a nM
Citation
 Bregman, HChakka, NGuzman-Perez, AGunaydin, HGu, YHuang, XBerry, VLiu, JTeffera, YHuang, LEgge, BMullady, ELSchneider, SAndrews, PSMishra, ANewcomb, JSerafino, RStrathdee, CATurci, SMWilson, CDiMauro, EF Discovery of novel, induced-pocket binding oxazolidinones as potent, selective, and orally bioavailable tankyrase inhibitors. J Med Chem 56:4320-42 (2013)  
Target
Name:
Poly [ADP-ribose] polymerase 1
Synonyms:
(ARTD1 or PARP1) 2.4.2.30 ADPRT ARTD1 Human diphtheria toxin-like ADP-ribosyltransferase (ARTD1 or PARP1) NT-PARP-1 PARP1 PPOL Poly [ADP-ribose] polymerase 1 (PARP) Poly [ADP-ribose] polymerase 1 (PARP1) Poly [ADP-ribose] polymerase 1, 28-kDa form Poly [ADP-ribose] polymerase 1, processed C-terminus Poly [ADP-ribose] polymerase-1 Poly(ADP-ribose) polymerase-1 (ARTD1/PARP1) Protein poly-ADP-ribosyltransferase PARP1 | Synonyms=ADPRT
Type:
Mol. Mass.:
113114.22
Organism:
Homo sapiens (Human)
Description:
P09874
Residue:
1014
  
Inhibitor
Name:
BDBM50294835
Synonyms:
4-((1S,2S,6R,7R)-3,5-Dioxo-4-aza-tricyclo[5.2.1.0*2,6*]dec-8-en-4-yl)-N-methyl-N-quinolin-8-yl-benzamide CHEMBL562310 | N-(Quinolin-8-yl)-4-(endo-4-aza-3,5-dioxotricyclo[5.2.1.02,6]oct-8-en-4-yl)benzamide, 1
Type:
Small organic molecule
Emp. Form.:
C25H19N3O3
Mol. Mass.:
409.4367
SMILES:
Oc1c2[C@H]3C[C@H](C=C3)c2c(O)n1-c1ccc(cc1)C(=O)Nc1cccc2cccnc12
: