Target
Fatty-acid amide hydrolase 1 [30-579]
Ligand
BDBM50434327
Substrate
Meas. Tech.
ChEMBL_960984 (CHEMBL2388900)
IC50
106±n/a nM
Target
Name:
Fatty-acid amide hydrolase 1 [30-579]
Synonyms:
Anandamide amidohydrolase 1 Faah Fatty Acid Amide Hydrolase Fatty-acid amide hydrolase (FAAH) Fatty-acid amide hydrolase 1 (FAAH) Oleamide hydrolase 1
Type:
Single-pass membrane protein; homodimer
Mol. Mass.:
60474.00
Organism:
Rattus norvegicus (rat)
Description:
P97612 (aa 30-579)
Residue:
550
  
Inhibitor
Name:
BDBM50434327
Synonyms:
CHEMBL2386556
Type:
Small organic molecule
Emp. Form.:
C24H25ClN4OS
Mol. Mass.:
453
SMILES:
CN(C)C(=O)[C@H]1C[C@@H]1c1ccc(cc1)-c1nc(C2CC2)n(C)c1Sc1ccc(Cl)cn1
: